Target
Folylpolyglutamate synthase, mitochondrial
Ligand
BDBM50011885
Substrate
Meas. Tech.
ChEBML_68542
Ki
150±n/a nM
Citation
 Rosowsky, AFreisheim, JHMoran, RGSolan, VCBader, HWright, JERadike-Smith, M Methotrexate analogues. 26. Inhibition of dihydrofolate reductase and folylpolyglutamate synthetase activity and in vitro tumor cell growth by methotrexate and aminopterin analogues containing a basic amino acid side chain. J Med Chem 29:655-60 (1986)  
Target
Name:
Folylpolyglutamate synthase, mitochondrial
Synonyms:
FOLC_MOUSE Folylpolyglutamate synthase, mitochondrial Tetrahydrofolate synthase | Tetrahydrofolylpolyglutamate synthase
Type:
PROTEIN
Mol. Mass.:
64969.76
Organism:
Mus musculus
Description:
ChEMBL_68680
Residue:
587
  
Inhibitor
Name:
BDBM50011885
Synonyms:
5-Amino-2-{4-[(2,4-diamino-pteridin-6-ylmethyl)-amino]-benzoylamino}-pentanoic acid | CHEMBL280864
Type:
Small organic molecule
Emp. Form.:
C19H23N9O3
Mol. Mass.:
425.4444
SMILES:
NCCCC(NC(=O)c1ccc(NCc2cnc3nc(N)nc(N)c3n2)cc1)C(O)=O
: