Target
Dihydrofolate reductase
Ligand
BDBM50367055
Substrate
Meas. Tech.
ChEBML_54441
IC50
35±n/a nM
Citation
 Rosowsky, AFreisheim, JHMoran, RGSolan, VCBader, HWright, JERadike-Smith, M Methotrexate analogues. 26. Inhibition of dihydrofolate reductase and folylpolyglutamate synthetase activity and in vitro tumor cell growth by methotrexate and aminopterin analogues containing a basic amino acid side chain. J Med Chem 29:655-60 (1986)  
Target
Name:
Dihydrofolate reductase
Synonyms:
DYR_MOUSE | Dhfr
Type:
Enzyme
Mol. Mass.:
21608.82
Organism:
Mus musculus (Mouse)
Description:
Residue:
187
  
Inhibitor
Name:
BDBM50367055
Synonyms:
4-Aminofolic acid AMINOPTERIN | Aminopteroylglutamic acid
Type:
Small organic molecule
Emp. Form.:
C19H20N8O5
Mol. Mass.:
440.4127
SMILES:
Nc1nc(N)c2nc(CNc3ccc(cc3)C(=O)N[C@@H](CCC(O)=O)C(O)=O)cnc2n1
: