Target
Aldo-keto reductase family 1 member B1
Ligand
BDBM50022179
Substrate
Meas. Tech.
ChEBML_31926
IC50
20±n/a nM
Citation
 Brubaker, ANDeRuiter, JWhitmer, WL Synthesis and rat lens aldose reductase inhibitory activity of some benzopyran-2-ones. J Med Chem 29:1094-9 (1986)  
Target
Name:
Aldo-keto reductase family 1 member B1
Synonyms:
ALDR_RAT Akr1b4 Aldr1
Type:
PROTEIN
Mol. Mass.:
35797.87
Organism:
Rattus norvegicus
Description:
ChEMBL_1512484
Residue:
316
  
Inhibitor
Name:
BDBM50022179
Synonyms:
(3-Oxo-3H-benzo[f]chromen-1-yl)-acetic acid | CHEMBL12655
Type:
Small organic molecule
Emp. Form.:
C15H10O4
Mol. Mass.:
254.2375
SMILES:
OC(=O)Cc1cc(=O)oc2ccc3ccccc3c12
: