Target
Histamine H1 receptor
Ligand
BDBM50019638
Substrate
Meas. Tech.
ChEBML_75330
IC50
>3000±n/a nM
Citation
 Iemura, RKawashima, TFukuda, TIto, KTsukamoto, G Synthesis of 2-(4-substituted-1-piperazinyl)benzimidazoles as H1-antihistaminic agents. J Med Chem 29:1178-83 (1987)  
Target
Name:
Histamine H1 receptor
Synonyms:
HISTAMINE H1 HRH1_CAVPO
Type:
G Protein-Coupled Receptor (GPCR)
Mol. Mass.:
55641.53
Organism:
Cavia porcellus (domestic guinea pig)
Description:
Guinea pig cerebellum was used in binding assay.
Residue:
488
  
Inhibitor
Name:
BDBM50019638
Synonyms:
2-(4-Methyl-piperazin-1-yl)-1H-benzoimidazole | CHEMBL18355
Type:
Small organic molecule
Emp. Form.:
C12H16N4
Mol. Mass.:
216.2822
SMILES:
CN1CCN(CC1)c1nc2ccccc2[nH]1
: