Target
Adenosine receptor A2a/A2b
Ligand
BDBM50452322
Substrate
Meas. Tech.
ChEMBL_27760 (CHEMBL643365)
EC50
3100±n/a nM
Citation
 Olsson, RAKusachi, SThompson, RDUkena, DPadgett, WDaly, JW N6-substituted N-alkyladenosine-5'-uronamides: bifunctional ligands having recognition groups for A1 and A2 adenosine receptors. J Med Chem 29:1683-9 (1986)  
Target
Name:
Adenosine receptor A2a/A2b
Synonyms:
Adenosine A2 receptor
Type:
Mol. Mass.:
Description:
ASSAY_ID of ChEMBL is 329906
Components:
This complex has 2 components.
Component 1
Name:
Adenosine receptor A2b
Synonyms:
AA2BR_HUMAN ADORA2B Adenosine receptors A2b | Adenosine receptors; A2a & A2b
Type:
G Protein-Coupled Receptor (GPCR)
Mol. Mass.:
36341.22
Organism:
Homo sapiens (Human)
Description:
Residue:
332
  
Component 2
Name:
Adenosine receptor A2a
Synonyms:
A2A adenosine receptor (hA2A) ADENOSINE A2 ADORA2 Adenosine A2A receptor (A2AAR)
Type:
G Protein-Coupled Receptor (GPCR)
Mol. Mass.:
44716.46
Organism:
Homo sapiens (Human)
Description:
P29274
Residue:
412
  
Inhibitor
Name:
BDBM50452322
Synonyms:
CHEMBL2093998
Type:
Small organic molecule
Emp. Form.:
C21H26N6O4
Mol. Mass.:
426.4689
SMILES:
CCNC(=O)[C@H]1O[C@H]([C@H](O)[C@@H]1O)n1cnc2c(N[C@H](C)Cc3ccccc3)ncnc12
: