Target
5-hydroxytryptamine receptor 1B
Ligand
BDBM21392
Substrate
Meas. Tech.
ChEBML_1800
Ki
5±n/a nM
Citation
 Glennon, RA Central serotonin receptors as targets for drug research. J Med Chem 30:1-12 (1987)  
Target
Name:
5-hydroxytryptamine receptor 1B
Synonyms:
5-HT-1B 5-hydroxytryptamine receptor 1B (5HT1B) 5ht1b Serotonin 1 (5-HT1) receptor Serotonin receptor 1B
Type:
Protein
Mol. Mass.:
43173.33
Organism:
Rattus norvegicus (Rat)
Description:
P28564
Residue:
386
  
Inhibitor
Name:
BDBM21392
Synonyms:
3-(2-aminoethyl)-1H-indole-5-carboxamide 5-CT,DP CHEMBL1256863 [3H]-5-CT [3H]-5-Carboxyamidotryptamine | [3H]-5-carboxamidotryptamine
Type:
Small organic molecule
Emp. Form.:
C11H13N3O
Mol. Mass.:
203.2404
SMILES:
NCCc1c[nH]c2ccc(cc12)C(N)=O
: