Target
5-hydroxytryptamine receptor 2C
Ligand
BDBM50024205
Substrate
Meas. Tech.
ChEBML_1848
Ki
60±n/a nM
Citation
 Glennon, RA Central serotonin receptors as targets for drug research. J Med Chem 30:1-12 (1987)  
Target
Name:
5-hydroxytryptamine receptor 2C
Synonyms:
5-HT-2C 5-HT2C-INI 5-HTR2C 5-hydroxytryptamine receptor 2C (5-HT-2C) 5HT-1C HTR1C Serotonin (5-HT3) receptor Serotonin Receptor 2C
Type:
G Protein-Coupled Receptor (GPCR)
Mol. Mass.:
51836.79
Organism:
Homo sapiens (Human)
Description:
P28335
Residue:
458
  
Inhibitor
Name:
BDBM50024205
Synonyms:
3-{2-[4-(4-Fluoro-benzoyl)-piperidin-1-yl]-ethyl}-2-methyl-pyrido[1,2-a]pyrimidin-4-one CHEMBL18331 | PIRENPERONE
Type:
Small organic molecule
Emp. Form.:
C23H24FN3O2
Mol. Mass.:
393.454
SMILES:
Cc1nc2ccccn2c(=O)c1CCN1CCC(CC1)C(=O)c1ccc(F)cc1
: