Target
Renin
Ligand
BDBM50022377
Substrate
Meas. Tech.
ChEBML_195767
IC50
40±n/a nM
Citation
 Dellaria, JFMaki, RGBopp, BACohen, JKleinert, HDLuly, JRMerits, IPlattner, JJStein, HH Optimization and in vivo evaluations of a series of small, potent, and specific renin inhibitors containing a novel Leu-Val replacement. J Med Chem 30:2137-44 (1987)  
Target
Name:
Renin
Synonyms:
Angiotensinogenase RENI_HUMAN
Type:
Enzyme
Mol. Mass.:
45058.99
Organism:
Homo sapiens (Human)
Description:
Residue:
406
  
Inhibitor
Name:
BDBM50022377
Synonyms:
CHEMBL3142224 | {1-[1-(1-Cyclohexylmethyl-2-hydroxy-3-methanesulfonyl-propylcarbamoyl)-2-(1H-imidazol-4-yl)-ethylcarbamoyl]-2-phenyl-ethyl}-carbamic acid tert-butyl ester
Type:
Small organic molecule
Emp. Form.:
C31H47N5O7S
Mol. Mass.:
633.799
SMILES:
CC(C)(C)OC(=O)N[C@@H](Cc1ccccc1)C(=O)N[C@@H](Cc1c[nH]cn1)C(=O)N[C@@H](CC1CCCCC1)[C@@H](O)CS(C)(=O)=O
: