Target
Thymidylate synthase
Ligand
BDBM50023903
Substrate
Meas. Tech.
ChEMBL_209474 (CHEMBL809254)
IC50
1260±n/a nM
Citation
 Brixner, DIUeda, TCheng, YCHynes, JBBroom, AD Folate analogues as inhibitors of thymidylate synthase. J Med Chem 30:675-8 (1987)  
Target
Name:
Thymidylate synthase
Synonyms:
TS TYMS Thymidylate synthase (TS) | Thymidylate synthase/GAR transformylase/AICAR transformylase
Type:
Enzyme
Mol. Mass.:
35718.07
Organism:
Homo sapiens (Human)
Description:
Residue:
313
  
Inhibitor
Name:
BDBM50023903
Synonyms:
2-{4-[(2,4-Diamino-pyrido[3,2-d]pyrimidin-6-ylmethyl)-prop-2-ynyl-amino]-benzoylamino}-pentanedioic acid | CHEMBL348979
Type:
Small organic molecule
Emp. Form.:
C23H23N7O5
Mol. Mass.:
477.4726
SMILES:
Nc1nc(N)c2nc(CN(CC#C)c3ccc(cc3)C(=O)NC(CCC(O)=O)C(O)=O)ccc2n1
: