Target
Aromatase
Ligand
BDBM50024487
Substrate
Meas. Tech.
ChEBML_51214
EC50
>2000±n/a nM
Citation
 Taylor, HMJones, CDDavenport, JDHirsch, KSKress, TJWeaver, D Aromatase inhibition by 5-substituted pyrimidines and dihydropyrimidines. J Med Chem 30:1359-65 (1987)  
Target
Name:
Aromatase
Synonyms:
Arom CP19A_RAT Cyp19 Cytochrome P450 19A1 P-450AROM
Type:
PROTEIN
Mol. Mass.:
58418.09
Organism:
Rattus norvegicus
Description:
ChEMBL_51211
Residue:
508
  
Inhibitor
Name:
BDBM50024487
Synonyms:
1-(4-Chloro-phenyl)-2-methyl-1-pyrimidin-5-yl-propan-1-ol | CHEMBL29646
Type:
Small organic molecule
Emp. Form.:
C14H15ClN2O
Mol. Mass.:
262.735
SMILES:
CC(C)C(O)(c1ccc(Cl)cc1)c1cncnc1
: