Target
Aromatase
Ligand
BDBM50024493
Substrate
Meas. Tech.
ChEBML_51214
EC50
4200±n/a nM
Citation
 Taylor, HMJones, CDDavenport, JDHirsch, KSKress, TJWeaver, D Aromatase inhibition by 5-substituted pyrimidines and dihydropyrimidines. J Med Chem 30:1359-65 (1987)  
Target
Name:
Aromatase
Synonyms:
Arom CP19A_RAT Cyp19 Cytochrome P450 19A1 P-450AROM
Type:
PROTEIN
Mol. Mass.:
58418.09
Organism:
Rattus norvegicus
Description:
ChEMBL_51211
Residue:
508
  
Inhibitor
Name:
BDBM50024493
Synonyms:
CHEMBL30081 | Cyclopropyl-(4-fluoro-phenyl)-pyrimidin-5-yl-methanol
Type:
Small organic molecule
Emp. Form.:
C14H13FN2O
Mol. Mass.:
244.2642
SMILES:
OC(C1CC1)(c1ccc(F)cc1)c1cncnc1
: