Target
Aromatase
Ligand
BDBM50024503
Substrate
Meas. Tech.
ChEBML_51214
EC50
>2000±n/a nM
Citation
 Taylor, HMJones, CDDavenport, JDHirsch, KSKress, TJWeaver, D Aromatase inhibition by 5-substituted pyrimidines and dihydropyrimidines. J Med Chem 30:1359-65 (1987)  
Target
Name:
Aromatase
Synonyms:
Arom CP19A_RAT Cyp19 Cytochrome P450 19A1 P-450AROM
Type:
PROTEIN
Mol. Mass.:
58418.09
Organism:
Rattus norvegicus
Description:
ChEMBL_51211
Residue:
508
  
Inhibitor
Name:
BDBM50024503
Synonyms:
CHEMBL28860 | Cyclopropyl-pyrimidin-5-yl-thiophen-2-yl-methanol
Type:
Small organic molecule
Emp. Form.:
C12H12N2OS
Mol. Mass.:
232.301
SMILES:
OC(C1CC1)(c1cccs1)c1cncnc1
: