Target
Aromatase
Ligand
BDBM50024515
Substrate
Meas. Tech.
ChEBML_51214
EC50
7800±n/a nM
Citation
 Taylor, HMJones, CDDavenport, JDHirsch, KSKress, TJWeaver, D Aromatase inhibition by 5-substituted pyrimidines and dihydropyrimidines. J Med Chem 30:1359-65 (1987)  
Target
Name:
Aromatase
Synonyms:
Arom CP19A_RAT Cyp19 Cytochrome P450 19A1 P-450AROM
Type:
PROTEIN
Mol. Mass.:
58418.09
Organism:
Rattus norvegicus
Description:
ChEMBL_51211
Residue:
508
  
Inhibitor
Name:
BDBM50024515
Synonyms:
Bicyclo[2.2.1]hept-2-yl-(4-chloro-phenyl)-pyrimidin-5-yl-methanol | CHEMBL26207
Type:
Small organic molecule
Emp. Form.:
C18H19ClN2O
Mol. Mass.:
314.809
SMILES:
OC(C1CC2CCC1C2)(c1ccc(Cl)cc1)c1cncnc1
: