Target
Aromatase
Ligand
BDBM50024517
Substrate
Meas. Tech.
ChEBML_51214
EC50
6200±n/a nM
Citation
 Taylor, HMJones, CDDavenport, JDHirsch, KSKress, TJWeaver, D Aromatase inhibition by 5-substituted pyrimidines and dihydropyrimidines. J Med Chem 30:1359-65 (1987)  
Target
Name:
Aromatase
Synonyms:
Arom CP19A_RAT Cyp19 Cytochrome P450 19A1 P-450AROM
Type:
PROTEIN
Mol. Mass.:
58418.09
Organism:
Rattus norvegicus
Description:
ChEMBL_51211
Residue:
508
  
Inhibitor
Name:
BDBM50024517
Synonyms:
CHEMBL27797 | Cyclooctyl-(4-methoxy-phenyl)-pyrimidin-5-yl-methanol
Type:
Small organic molecule
Emp. Form.:
C20H26N2O2
Mol. Mass.:
326.4326
SMILES:
COc1ccc(cc1)C(O)(C1CCCCCCC1)c1cncnc1
: