Target
Transporter
Ligand
BDBM50021874
Substrate
Meas. Tech.
ChEBML_193336
Ki
557±n/a nM
Citation
 Maryanoff, BEMcComsey, DFGardocki, JFShank, RPCostanzo, MJNortey, SOSchneider, CRSetler, PE Pyrroloisoquinoline antidepressants. 2. In-depth exploration of structure-activity relationships. J Med Chem 30:1433-54 (1987)  
Target
Name:
Transporter
Synonyms:
Monoamine transporters; Norepininephrine & dopamine | Norepinephrine Monoamine transporters
Type:
PROTEIN
Mol. Mass.:
66787.87
Organism:
Rattus norvegicus
Description:
ChEMBL_1463061
Residue:
597
  
Inhibitor
Name:
BDBM50021874
Synonyms:
6-Phenyl-1,2,3,5,6,10b-hexahydro-pyrrolo[2,1-a]isoquinoline;C4H4O4 6-Phenyl-1,2,3,5,6,10b-hexahydro-pyrrolo[2,1-a]isoquinoline;HCl | CHEMBL35184
Type:
Small organic molecule
Emp. Form.:
C18H19N
Mol. Mass.:
249.3502
SMILES:
C1C[C@H]2N(C1)C[C@@H](c1ccccc1)c1ccccc21
: