Target
Substance-P receptor
Ligand
BDBM50016445
Substrate
Meas. Tech.
ChEBML_198108
Ki
>10000±n/a nM
Citation
 Jacobson, KALipkowski, AWMoody, TWPadgett, WPijl, EKirk, KLDaly, JW Binary drugs: conjugates of purines and a peptide that bind to both adenosine and substance P receptors. J Med Chem 30:1529-32 (1987)  
Target
Name:
Substance-P receptor
Synonyms:
NK-1 receptor NK1 Receptor Neurokinin 1 receptor SPR Tac1r Tacr1
Type:
G Protein-Coupled Receptor (GPCR)
Mol. Mass.:
46371.54
Organism:
Rattus norvegicus (rat)
Description:
Competition binding assays were carried out using membrane preparations from transfected CHO cells that constitutively expressed the rat NK1 receptor.
Residue:
407
  
Inhibitor
Name:
BDBM50016445
Synonyms:
2-{2-[2-(2-Amino-3-phenyl-propionylamino)-3-phenyl-propionylamino]-acetylamino}-4-methyl-pentanoic acid (1-carbamoyl-3-methylsulfanyl-propyl)-amide | CHEMBL2372353
Type:
Small organic molecule
Emp. Form.:
C33H46N6O6S
Mol. Mass.:
654.82
SMILES:
CSCC[C@@H](NC(=O)[C@H](CC(C)C)NC(=O)CNC(=O)[C@H](Cc1ccccc1)NC(=O)[C@H](Cc1ccccc1)NC(C)=O)C(N)=O
: