Target
Adenosine receptor A1
Ligand
BDBM50009525
Substrate
Meas. Tech.
ChEBML_29324
Ki
9.30±n/a nM
Citation
 Trivedi, BKBristol, JABruns, RFHaleen, SJSteffen, RP N6-(arylalkyl)adenosines. Identification of N6-(9-fluorenylmethyl)adenosine as a highly potent agonist for the adenosine A2 receptor. J Med Chem 31:271-3 (1988)  
Target
Name:
Adenosine receptor A1
Synonyms:
AA1R_RAT ADENOSINE A1 high Adenosine A1 receptor (A1) Adenosine receptors A1 | Adora1
Type:
Protein
Mol. Mass.:
36704.13
Organism:
Rattus norvegicus (rat)
Description:
Residue:
326
  
Inhibitor
Name:
BDBM50009525
Synonyms:
2-CI Adenosine 2-Chloroado CHEMBL285819
Type:
Small organic molecule
Emp. Form.:
C10H12ClN5O4
Mol. Mass.:
301.686
SMILES:
Nc1nc(Cl)nc2n(cnc12)[C@@H]1O[C@H](CO)[C@@H](O)[C@H]1O
: