Target
Phenylethanolamine N-methyltransferase
Ligand
BDBM50367603
Substrate
Meas. Tech.
ChEBML_153308
Ki
2440000±n/a nM
Citation
 Grunewald, GLYe, QH Stereochemical aspects of phenylethanolamine analogues as substrates of phenylethanolamine N-methyltransferase. J Med Chem 31:1984-6 (1988)  
Target
Name:
Phenylethanolamine N-methyltransferase
Synonyms:
Noradrenaline N-methyltransferase PNMT_BOVIN | PNMTase
Type:
Enzyme
Mol. Mass.:
30916.97
Organism:
Bos taurus (bovine)
Description:
Residue:
283
  
Inhibitor
Name:
BDBM50367603
Synonyms:
CHEMBL1788114
Type:
Small organic molecule
Emp. Form.:
C9H13NO
Mol. Mass.:
151.2056
SMILES:
C[C@@H](N)[C@H](O)c1ccccc1
: