Target
Phenylethanolamine N-methyltransferase
Ligand
BDBM50023139
Substrate
Meas. Tech.
ChEBML_153308
Ki
4600±n/a nM
Citation
 Grunewald, GLYe, QH Stereochemical aspects of phenylethanolamine analogues as substrates of phenylethanolamine N-methyltransferase. J Med Chem 31:1984-6 (1988)  
Target
Name:
Phenylethanolamine N-methyltransferase
Synonyms:
Noradrenaline N-methyltransferase PNMT_BOVIN | PNMTase
Type:
Enzyme
Mol. Mass.:
30916.97
Organism:
Bos taurus (bovine)
Description:
Residue:
283
  
Inhibitor
Name:
BDBM50023139
Synonyms:
2-Amino-1,2,3,4-tetrahydro-naphthalen-1-ol TRANS-(1S,2S)-2-AMINO-1,2,3,4-TETRAHYDRONAPHTHALEN-1-OL
Type:
Small organic molecule
Emp. Form.:
C10H13NO
Mol. Mass.:
163.2163
SMILES:
N[C@H]1CCc2ccccc2[C@@H]1O
: