Target
Mu-type opioid receptor
Ligand
BDBM50019097
Substrate
Meas. Tech.
ChEBML_148709
Kd
154±n/a nM
Citation
 Lawson, JACheng, ADeGraw, JFrenking, GUyeno, EToll, LLoew, GH Effects of addition of a 2-methyl group to ethyl nipecotates (beta-meperidines) on receptor affinities and opiate agonist/antagonist activities. J Med Chem 31:2015-21 (1988)  
Target
Name:
Mu-type opioid receptor
Synonyms:
MOR-1 Mu-type opioid receptor (MOR) OPRM_RAT Opioid receptor B Ror-b
Type:
G Protein-Coupled Receptor (GPCR)
Mol. Mass.:
44503.11
Organism:
Rattus norvegicus (rat)
Description:
Competition binding assays were carried out using membrane preparations from transfected HN9.10 cells that constitutively expressed the mu opioid receptor.
Residue:
398
  
Inhibitor
Name:
BDBM50019097
Synonyms:
1-Cyclopropylmethyl-3-(3-hydroxy-phenyl)-2-methyl-piperidine-3-carboxylic acid ethyl ester | CHEMBL293655
Type:
Small organic molecule
Emp. Form.:
C19H27NO3
Mol. Mass.:
317.4226
SMILES:
CCOC(=O)[C@@]1(CCCN(CC2CC2)[C@H]1C)c1cccc(O)c1
: