Target
D(2) dopamine receptor
Ligand
BDBM50012967
Substrate
Meas. Tech.
ChEMBL_61586 (CHEMBL675758)
IC50
3.3±n/a nM
Citation
 de Paulis, TJanowsky, AKessler, RMClanton, JASmith, HE (S)-N-[(1-ethyl-2-pyrrolidinyl)methyl]-5-[125I]iodo- 2-methoxybenzamide hydrochloride, a new selective radioligand for dopamine D-2 receptors. J Med Chem 31:2027-33 (1988)  
Target
Name:
D(2) dopamine receptor
Synonyms:
DOPAMINE D2 DOPAMINE D2 Short Dopamine D2 receptor Drd2
Type:
G Protein-Coupled Receptor (GPCR)
Mol. Mass.:
50931.60
Organism:
Rattus norvegicus (rat)
Description:
P61169
Residue:
444
  
Inhibitor
Name:
BDBM50012967
Synonyms:
CHEMBL49897 N-(1-Ethyl-pyrrolidin-2-ylmethyl)-5-iodo-2-methoxy-benzamide (iodopride) | N-(1-Ethyl-pyrrolidin-2-ylmethyl)-5-iodo-2-methoxy-benzamide(iodopride)
Type:
Small organic molecule
Emp. Form.:
C15H21IN2O2
Mol. Mass.:
388.2439
SMILES:
CCN1CCC[C@H]1CNC(=O)c1cc(I)ccc1OC
: