Target
D(2) dopamine receptor
Ligand
BDBM82248
Substrate
Meas. Tech.
ChEBML_61117
Ki
20±n/a nM
Citation
 Baindur, NNeumeyer, JLNiznik, HBBzowej, NHJarvie, KRSeeman, PGarlick, RKMiller, JJ A photoaffinity label for the D-1 dopamine receptor, (RS)-7-[125I]Iodo-8-hydroxy-3-methyl-1-(4'-azidophenyl)-2,3,4,5- tetrahydro-1H-3-benzazepine, selectively identifies the ligand binding subunits of the receptor. J Med Chem 31:2069-71 (1988)  
Target
Name:
D(2) dopamine receptor
Synonyms:
D(2) dopamine receptor DOPAMINE D2 Long DRD2 Dopamine D2 receptor Dopamine D2 receptor (D2R) Dopamine2-like | d2
Type:
Cell-surface receptors
Mol. Mass.:
50647.10
Organism:
Homo sapiens (Human)
Description:
P14416
Residue:
443
  
Inhibitor
Name:
BDBM82248
Synonyms:
CAS_73445-63-3 | SCH 23388 (S-enantiomer)
Type:
Small organic molecule
Emp. Form.:
C17H18ClNO
Mol. Mass.:
287.784
SMILES:
CN1CCc2cc(Cl)c(O)cc2[C@@H](C1)c1ccccc1
: