Target
Gastrin/cholecystokinin type B receptor
Ligand
BDBM50060321
Substrate
Meas. Tech.
ChEBML_75463
IC50
1400±n/a nM
Citation
 Evans, BERittle, KEBock, MGDiPardo, RMFreidinger, RMWhitter, WLLundell, GFVeber, DFAnderson, PSChang, RS Methods for drug discovery: development of potent, selective, orally effective cholecystokinin antagonists. J Med Chem 31:2235-46 (1989)  
Target
Name:
Gastrin/cholecystokinin type B receptor
Synonyms:
CCK-2 receptor CCK-BR CCKRB Cholecystokinin receptor GASR_HUMAN | Gastrin/cholecystokinin type B receptor
Type:
G Protein-Coupled Receptor (GPCR)
Mol. Mass.:
48445.79
Organism:
Homo sapiens (Human)
Description:
Stable expression of human CCK-2 receptors in HEK 293 cells.
Residue:
447
  
Inhibitor
Name:
BDBM50060321
Synonyms:
1H-Indole-2-carboxylic acid ((R)-1-methyl-2-oxo-5-phenyl-2,3-dihydro-1H-benzo[e][1,4]diazepin-3-yl)-amide CCK antagonist synthetic 19 | CHEMBL419764
Type:
Small organic molecule
Emp. Form.:
C25H20N4O2
Mol. Mass.:
408.4519
SMILES:
CN1c2ccccc2C(=N[C@@H](NC(=O)c2cc3ccccc3[nH]2)C1=O)c1ccccc1
: