Target
Gastrin/cholecystokinin type B receptor
Ligand
BDBM50019249
Substrate
Meas. Tech.
ChEBML_75463
IC50
6300±n/a nM
Citation
 Evans, BERittle, KEBock, MGDiPardo, RMFreidinger, RMWhitter, WLLundell, GFVeber, DFAnderson, PSChang, RS Methods for drug discovery: development of potent, selective, orally effective cholecystokinin antagonists. J Med Chem 31:2235-46 (1989)  
Target
Name:
Gastrin/cholecystokinin type B receptor
Synonyms:
CCK-2 receptor CCK-BR CCKRB Cholecystokinin receptor GASR_HUMAN | Gastrin/cholecystokinin type B receptor
Type:
G Protein-Coupled Receptor (GPCR)
Mol. Mass.:
48445.79
Organism:
Homo sapiens (Human)
Description:
Stable expression of human CCK-2 receptors in HEK 293 cells.
Residue:
447
  
Inhibitor
Name:
BDBM50019249
Synonyms:
1-Methyl-1H-indole-2-carboxylic acid [5-(2-fluoro-phenyl)-2-oxo-2,3-dihydro-1H-benzo[e][1,4]diazepin-3-yl]-amide CHEMBL73885
Type:
Small organic molecule
Emp. Form.:
C25H19FN4O2
Mol. Mass.:
426.4424
SMILES:
Cn1c(cc2ccccc12)C(=O)NC1N=C(c2ccccc2F)c2ccccc2NC1=O
: