Target
Gastrin/cholecystokinin type B receptor
Ligand
BDBM50019182
Substrate
Meas. Tech.
ChEBML_75463
IC50
390±n/a nM
Citation
 Evans, BERittle, KEBock, MGDiPardo, RMFreidinger, RMWhitter, WLLundell, GFVeber, DFAnderson, PSChang, RS Methods for drug discovery: development of potent, selective, orally effective cholecystokinin antagonists. J Med Chem 31:2235-46 (1989)  
Target
Name:
Gastrin/cholecystokinin type B receptor
Synonyms:
CCK-2 receptor CCK-BR CCKRB Cholecystokinin receptor GASR_HUMAN | Gastrin/cholecystokinin type B receptor
Type:
G Protein-Coupled Receptor (GPCR)
Mol. Mass.:
48445.79
Organism:
Homo sapiens (Human)
Description:
Stable expression of human CCK-2 receptors in HEK 293 cells.
Residue:
447
  
Inhibitor
Name:
BDBM50019182
Synonyms:
CHEMBL307661 | {5-(2-Fluoro-phenyl)-3-[(1H-indole-2-carbonyl)-amino]-2-oxo-2,3-dihydro-benzo[e][1,4]diazepin-1-yl}-acetic acid: C3H6O. 0.8H2O
Type:
Small organic molecule
Emp. Form.:
C26H19FN4O4
Mol. Mass.:
470.4519
SMILES:
OC(=O)CN1c2ccccc2C(=NC(NC(=O)c2cc3ccccc3[nH]2)C1=O)c1ccccc1F
: