Target
Cholecystokinin receptor type A
Ligand
BDBM50019217
Substrate
Meas. Tech.
ChEBML_49558
IC50
5±n/a nM
Citation
 Evans, BERittle, KEBock, MGDiPardo, RMFreidinger, RMWhitter, WLLundell, GFVeber, DFAnderson, PSChang, RS Methods for drug discovery: development of potent, selective, orally effective cholecystokinin antagonists. J Med Chem 31:2235-46 (1989)  
Target
Name:
Cholecystokinin receptor type A
Synonyms:
CCKAR_RAT Cholecystokinin peripheral Cholecystokinin receptor type A
Type:
Enzyme Catalytic Domain
Mol. Mass.:
49676.37
Organism:
RAT
Description:
Cholecystokinin central 0 RAT::P30551
Residue:
444
  
Inhibitor
Name:
BDBM50019217
Synonyms:
5-Fluoro-1H-indole-2-carboxylic acid [5-(2-fluoro-phenyl)-2-oxo-2,3-dihydro-1H-benzo[e][1,4]diazepin-3-yl]-amide CHEMBL308111
Type:
Small organic molecule
Emp. Form.:
C24H16F2N4O2
Mol. Mass.:
430.4062
SMILES:
Fc1ccc2[nH]c(cc2c1)C(=O)NC1N=C(c2ccccc2F)c2ccccc2NC1=O
: