Target
Cholecystokinin receptor type A
Ligand
BDBM50019184
Substrate
Meas. Tech.
ChEBML_49558
IC50
120±n/a nM
Citation
 Evans, BERittle, KEBock, MGDiPardo, RMFreidinger, RMWhitter, WLLundell, GFVeber, DFAnderson, PSChang, RS Methods for drug discovery: development of potent, selective, orally effective cholecystokinin antagonists. J Med Chem 31:2235-46 (1989)  
Target
Name:
Cholecystokinin receptor type A
Synonyms:
CCKAR_RAT Cholecystokinin peripheral Cholecystokinin receptor type A
Type:
Enzyme Catalytic Domain
Mol. Mass.:
49676.37
Organism:
RAT
Description:
Cholecystokinin central 0 RAT::P30551
Residue:
444
  
Inhibitor
Name:
BDBM50019184
Synonyms:
5-Bromo-1H-indole-2-carboxylic acid [5-(2-fluoro-phenyl)-2-oxo-2,3-dihydro-1H-benzo[e][1,4]diazepin-3-yl]-amide CHEMBL72667
Type:
Small organic molecule
Emp. Form.:
C24H16BrFN4O2
Mol. Mass.:
491.312
SMILES:
Fc1ccccc1C1=NC(NC(=O)c2cc3cc(Br)ccc3[nH]2)C(=O)Nc2ccccc12
: