Target
D(2) dopamine receptor
Ligand
BDBM50019967
Substrate
Meas. Tech.
ChEBML_58693
IC50
900±n/a nM
Citation
 Liljefors, TBøgesø, KP Conformational analysis and structural comparisons of (1R,3S)-(+)- and (1S,3R)-(-)-tefludazine, (S)-(+)- and (R)-(-)-octoclothepin, and (+)-dexclamol in relation to dopamine receptor antagonism and amine-uptake inhibition. J Med Chem 31:306-12 (1988)  
Target
Name:
D(2) dopamine receptor
Synonyms:
DOPAMINE D2 DOPAMINE D2 Short Dopamine D2 receptor Drd2
Type:
G Protein-Coupled Receptor (GPCR)
Mol. Mass.:
50931.60
Organism:
Rattus norvegicus (rat)
Description:
P61169
Residue:
444
  
Inhibitor
Name:
BDBM50019967
Synonyms:
3-isopropyl-(3R,4aR,13bR)-2,3,4,4a,8,9,13b,14-octahydro-1H-benzo[6,7]cyclohepta[de]pyrido[2,1-a]isoquinolin-3-ol | CHEMBL320656
Type:
Small organic molecule
Emp. Form.:
C24H29NO
Mol. Mass.:
347.4932
SMILES:
CC(C)[C@@]1(O)CCN2C[C@@H]3c4ccccc4CCc4cccc([C@H]2C1)c34
: