Target
Adenosine deaminase
Ligand
BDBM50011565
Substrate
Meas. Tech.
ChEBML_30803
Ki
71000±n/a nM
Citation
 Cristalli, GFranchetti, PGrifantini, MVittori, SLupidi, GRiva, FBordoni, TGeroni, CVerini, MA Adenosine deaminase inhibitors. Synthesis and biological activity of deaza analogues of erythro-9-(2-hydroxy-3-nonyl)adenine. J Med Chem 31:390-3 (1988)  
Target
Name:
Adenosine deaminase
Synonyms:
ADA Adenosine aminohydrolase
Type:
Enzyme
Mol. Mass.:
40910.44
Organism:
Bos taurus (bovine)
Description:
Residue:
363
  
Inhibitor
Name:
BDBM50011565
Synonyms:
3-(4-Amino-benzoimidazol-1-yl)-nonan-2-ol | CHEMBL17822
Type:
Small organic molecule
Emp. Form.:
C16H25N3O
Mol. Mass.:
275.3892
SMILES:
CCCCCCC(C(C)O)n1cnc2c(N)cccc12
: