Target
D(2) dopamine receptor
Ligand
BDBM50012961
Substrate
Meas. Tech.
ChEBML_63034
Ki
0.633000±n/a nM
Citation
 Kung, HFKasliwal, RPan, SGKung, MPMach, RHGuo, YZ Dopamine D-2 receptor imaging radiopharmaceuticals: synthesis, radiolabeling, and in vitro binding of (R)-(+)- and (S)-(-)-3-iodo-2-hydroxy-6-methoxy-N- [(1-ethyl-2-pyrrolidinyl)methyl]benzamide. J Med Chem 31:1039-43 (1988)  
Target
Name:
D(2) dopamine receptor
Synonyms:
DOPAMINE D2 DOPAMINE D2 Short Dopamine D2 receptor Drd2
Type:
G Protein-Coupled Receptor (GPCR)
Mol. Mass.:
50931.60
Organism:
Rattus norvegicus (rat)
Description:
P61169
Residue:
444
  
Inhibitor
Name:
BDBM50012961
Synonyms:
(-)-(S)-N-((1-ethylpyrrolidin-2-yl)methyl)-2-hydroxy-3-iodo-6-methoxybenzamide CHEMBL267723 N-(1-Ethyl-pyrrolidin-2-ylmethyl)-2-hydroxy-3-iodo-6-methoxy-benzamide N-(1-Ethyl-pyrrolidin-2-ylmethyl)-2-hydroxy-3-iodo-6-methoxy-benzamide( (S)-(-)IBZM)
Type:
Small organic molecule
Emp. Form.:
C15H21IN2O3
Mol. Mass.:
404.2433
SMILES:
CCN1CCC[C@H]1CNC(=O)c1c(O)c(I)ccc1OC
: