Target
Angiotensin-converting enzyme
Ligand
BDBM50018850
Substrate
Meas. Tech.
ChEMBL_34932 (CHEMBL647677)
Ki
0.400000±n/a nM
Citation
 Krapcho, JTurk, CCushman, DWPowell, JRDeForrest, JMSpitzmiller, ERKaranewsky, DSDuggan, MRovnyak, GSchwartz, J Angiotensin-converting enzyme inhibitors. Mercaptan, carboxyalkyl dipeptide, and phosphinic acid inhibitors incorporating 4-substituted prolines. J Med Chem 31:1148-60 (1988)  
Target
Name:
Angiotensin-converting enzyme
Synonyms:
3.2.1.- ACE Angiotensin-converting enzyme, soluble form DCP1 Kininase II
Type:
Mol. Mass.:
150405.15
Organism:
Oryctolagus cuniculus
Description:
Residue:
1310
  
Inhibitor
Name:
BDBM50018850
Synonyms:
1-(3-Mercapto-2-methyl-propionyl)-4-phenylsulfanyl-pyrrolidine-2-carboxylic acid L-PROLINE, 1-[(2S)-3-MERCAPTO-2-METHYL-1-OXOPROPYL]-4-(PHENYLTHIO)-, 4S
Type:
Small organic molecule
Emp. Form.:
C15H19NO3S2
Mol. Mass.:
325.446
SMILES:
C[C@H](CS)C(=O)N1C[C@H](C[C@H]1C(O)=O)Sc1ccccc1
: