Target
Angiotensin-converting enzyme
Ligand
BDBM50367254
Substrate
Meas. Tech.
ChEBML_34931
Ki
1.4±n/a nM
Citation
 Krapcho, JTurk, CCushman, DWPowell, JRDeForrest, JMSpitzmiller, ERKaranewsky, DSDuggan, MRovnyak, GSchwartz, J Angiotensin-converting enzyme inhibitors. Mercaptan, carboxyalkyl dipeptide, and phosphinic acid inhibitors incorporating 4-substituted prolines. J Med Chem 31:1148-60 (1988)  
Target
Name:
Angiotensin-converting enzyme
Synonyms:
3.2.1.- ACE Angiotensin-converting enzyme, soluble form DCP1 Kininase II
Type:
Mol. Mass.:
150405.15
Organism:
Oryctolagus cuniculus
Description:
Residue:
1310
  
Inhibitor
Name:
BDBM50367254
Synonyms:
ENALAPRILAT
Type:
Small organic molecule
Emp. Form.:
C18H24N2O5
Mol. Mass.:
348.3936
SMILES:
C[C@H](N[C@@H](CCc1ccccc1)C(O)=O)C(=O)N1CCC[C@H]1C(O)=O
: