Target
Adenosine receptor A2a/A2b
Ligand
BDBM50367691
Substrate
Meas. Tech.
ChEMBL_30714 (CHEMBL646481)
Ki
5.6±n/a nM
Citation
 Bridges, AJBruns, RFOrtwine, DFPriebe, SRSzotek, DLTrivedi, BK N6-[2-(3,5-dimethoxyphenyl)-2-(2-methylphenyl)ethyl]adenosine and its uronamide derivatives. Novel adenosine agonists with both high affinity and high selectivity for the adenosine A2 receptor. J Med Chem 31:1282-5 (1988)  
Target
Name:
Adenosine receptor A2a/A2b
Synonyms:
Adenosine A2 receptor
Type:
Mol. Mass.:
Description:
ASSAY_ID of ChEMBL is 30560
Components:
This complex has 2 components.
Component 1
Name:
Adenosine receptor A2b
Synonyms:
AA2BR_RAT Adora2b
Type:
PROTEIN
Mol. Mass.:
36378.84
Organism:
Rattus norvegicus
Description:
ChEMBL_32934
Residue:
332
  
Component 2
Name:
Adenosine receptor A2a
Synonyms:
AA2AR_RAT Adenosine A2 receptor Adenosine Receptors A2a (A2a) Adenosine receptors A2a Rat striatal adenosine A2a receptor
Type:
G Protein-Coupled Receptor (GPCR)
Mol. Mass.:
45015.65
Organism:
Rattus norvegicus (rat)
Description:
Rat A2A receptors expressed in CHO cells.
Residue:
410
  
Inhibitor
Name:
BDBM50367691
Synonyms:
CHEMBL604818
Type:
Small organic molecule
Emp. Form.:
C29H34N6O6
Mol. Mass.:
562.6169
SMILES:
CCNC(=O)[C@H]1OC([C@H](O)[C@@H]1O)n1cnc2c(NCC(c3cc(OC)cc(OC)c3)c3ccccc3C)ncnc12
: