Target
D(2) dopamine receptor
Ligand
BDBM50020116
Substrate
Meas. Tech.
ChEBML_62891
Ki
345±n/a nM
Citation
 Abou-Gharbia, MPatel, URWebb, MBMoyer, JAAndree, THMuth, EA Polycyclic aryl- and heteroarylpiperazinyl imides as 5-HT1A receptor ligands and potential anxiolytic agents: synthesis and structure-activity relationship studies. J Med Chem 31:1382-92 (1988)  
Target
Name:
D(2) dopamine receptor
Synonyms:
DOPAMINE D2 DOPAMINE D2 Short Dopamine D2 receptor Drd2
Type:
G Protein-Coupled Receptor (GPCR)
Mol. Mass.:
50931.60
Organism:
Rattus norvegicus (rat)
Description:
P61169
Residue:
444
  
Inhibitor
Name:
BDBM50020116
Synonyms:
4-[4-(6'-Chloro-2,3,5,6-tetrahydro-[1,2']bipyrazinyl-4-yl)-butyl]-4-aza-tricyclo[5.4.2.0*2,6*]tridec-12-ene-3,5-dione;Hydrochloride | CHEMBL412258
Type:
Small organic molecule
Emp. Form.:
C24H32ClN5O2
Mol. Mass.:
457.996
SMILES:
Clc1cncc(n1)N1CCN(CCCCN2C(=O)C3C(C4CCCCC3C=C4)C2=O)CC1
: