Target
5-hydroxytryptamine receptor 1A
Ligand
BDBM50020126
Substrate
Meas. Tech.
ChEBML_1423
Ki
19±n/a nM
Citation
 Abou-Gharbia, MPatel, URWebb, MBMoyer, JAAndree, THMuth, EA Polycyclic aryl- and heteroarylpiperazinyl imides as 5-HT1A receptor ligands and potential anxiolytic agents: synthesis and structure-activity relationship studies. J Med Chem 31:1382-92 (1988)  
Target
Name:
5-hydroxytryptamine receptor 1A
Synonyms:
5-HT-1A 5-HT1A 5-hydroxytryptamine receptor 1A (5HT1A) 5ht1a Htr1a Serotonin 1a (5-HT1a) receptor/Adrenergic receptor alpha-1 | Serotonin receptor 1A
Type:
G Protein-Coupled Receptor (GPCR)
Mol. Mass.:
46445.29
Organism:
Rattus norvegicus (rat)
Description:
Binding assays were performed using rat hippocampal membranes.
Residue:
422
  
Inhibitor
Name:
BDBM50020126
Synonyms:
4-{4-[4-(3-chlorophenyl)hexahydro-1-pyrazinyl]butyl}-4-azatetracyclo[5.4.2.02,6.08,11]tridec-12-ene-3,5-dione;Hydrochloride | CHEMBL418762
Type:
Small organic molecule
Emp. Form.:
C26H32ClN3O2
Mol. Mass.:
454.004
SMILES:
Clc1cccc(c1)N1CCN(CCCCN2C(=O)C3C(C4C=CC3C3CCC43)C2=O)CC1
: