Target
D(2) dopamine receptor
Ligand
BDBM50367723
Substrate
Meas. Tech.
ChEBML_62891
Ki
140±n/a nM
Citation
 Abou-Gharbia, MPatel, URWebb, MBMoyer, JAAndree, THMuth, EA Polycyclic aryl- and heteroarylpiperazinyl imides as 5-HT1A receptor ligands and potential anxiolytic agents: synthesis and structure-activity relationship studies. J Med Chem 31:1382-92 (1988)  
Target
Name:
D(2) dopamine receptor
Synonyms:
DOPAMINE D2 DOPAMINE D2 Short Dopamine D2 receptor Drd2
Type:
G Protein-Coupled Receptor (GPCR)
Mol. Mass.:
50931.60
Organism:
Rattus norvegicus (rat)
Description:
P61169
Residue:
444
  
Inhibitor
Name:
BDBM50367723
Synonyms:
CHEMBL1202494
Type:
Small organic molecule
Emp. Form.:
C23H31N5O2
Mol. Mass.:
409.5245
SMILES:
O=C1C2C(C3CCC2C2CC32)C(=O)N1CCCCN1CCN(CC1)c1ncccn1
: