Target
Renin
Ligand
BDBM50367761
Substrate
Meas. Tech.
ChEBML_196299
IC50
65±n/a nM
Citation
 Hui, KYHoltzman, EJQuinones, MAHollenberg, NKHaber, E Design of rat renin inhibitory peptides. J Med Chem 31:1679-86 (1988)  
Target
Name:
Renin
Synonyms:
RENI_RAT Ren1
Type:
PROTEIN
Mol. Mass.:
44272.67
Organism:
Rattus norvegicus
Description:
ChEMBL_222765
Residue:
402
  
Inhibitor
Name:
BDBM50367761
Synonyms:
CHEMBL1790252
Type:
Small organic molecule
Emp. Form.:
C57H79N13O9
Mol. Mass.:
1090.3189
SMILES:
CC[C@@H](C)[C@H](NC(=O)C[C@H](O)[C@H](CC1CCCCC1)NC(=O)[C@H](Cc1cnc[nH]1)NC(=O)[C@H](Cc1ccccc1)NC(=O)[C@H]1CCCN1C(=O)[C@H](Cc1cnc[nH]1)NC(=O)[C@H]1CCCN1)C(=O)N[C@@H](Cc1ccccc1)C(N)=O
: