Target
Renin
Ligand
BDBM50022001
Substrate
Meas. Tech.
ChEBML_196299
IC50
220±n/a nM
Citation
 Hui, KYHoltzman, EJQuinones, MAHollenberg, NKHaber, E Design of rat renin inhibitory peptides. J Med Chem 31:1679-86 (1988)  
Target
Name:
Renin
Synonyms:
RENI_RAT Ren1
Type:
PROTEIN
Mol. Mass.:
44272.67
Organism:
Rattus norvegicus
Description:
ChEMBL_222765
Residue:
402
  
Inhibitor
Name:
BDBM50022001
Synonyms:
Ac-His-Pro-Napa-His-Statine-Leu-Phe-NH2 | CHEMBL274075
Type:
Small organic molecule
Emp. Form.:
C55H72N12O9
Mol. Mass.:
1045.2352
SMILES:
CC(C)C[C@H](NC(=O)[C@H](Cc1cnc[nH]1)NC(=O)[C@H](Cc1cccc2ccccc12)NC(=O)[C@H]1CCCN1C(=O)[C@H](Cc1cnc[nH]1)NC(C)=O)[C@@H](O)CC(=O)N[C@@H](CC(C)C)C(=O)N[C@@H](Cc1ccccc1)C(N)=O
: