Target
Renin
Ligand
BDBM50022002
Substrate
Meas. Tech.
ChEBML_196299
IC50
30±n/a nM
Citation
 Hui, KYHoltzman, EJQuinones, MAHollenberg, NKHaber, E Design of rat renin inhibitory peptides. J Med Chem 31:1679-86 (1988)  
Target
Name:
Renin
Synonyms:
RENI_RAT Ren1
Type:
PROTEIN
Mol. Mass.:
44272.67
Organism:
Rattus norvegicus
Description:
ChEMBL_222765
Residue:
402
  
Inhibitor
Name:
BDBM50022002
Synonyms:
1-[2-Acetylamino-3-(3H-imidazol-4-yl)-propionyl]-pyrrolidine-2-carboxylic acid {1-[1-(1-{2-[1-(1-carbamoyl-2-phenyl-ethylcarbamoyl)-3-methyl-butylcarbamoyl]-1-hydroxy-ethyl}-3-methyl-butylcarbamoyl)-2-methyl-propylcarbamoyl]-2-phenyl-ethyl}-amide | CHEMBL385618
Type:
Small organic molecule
Emp. Form.:
C50H72N10O9
Mol. Mass.:
957.1683
SMILES:
CC(C)C[C@H](NC(=O)[C@@H](NC(=O)[C@H](Cc1ccccc1)NC(=O)[C@H]1CCCN1C(=O)[C@H](Cc1cnc[nH]1)NC(C)=O)C(C)C)[C@@H](O)CC(=O)N[C@@H](CC(C)C)C(=O)N[C@@H](Cc1ccccc1)C(N)=O
: