Target
Aldo-keto reductase family 1 member B1
Ligand
BDBM50016549
Substrate
Meas. Tech.
ChEBML_32099
IC50
1800±n/a nM
Citation
 DeRuiter, JBorne, RFMayfield, CA N- and 2-substituted N-(phenylsulfonyl)glycines as inhibitors of rat lens aldose reductase. J Med Chem 32:145-51 (1989)  
Target
Name:
Aldo-keto reductase family 1 member B1
Synonyms:
ALDR_RAT Akr1b4 Aldr1
Type:
PROTEIN
Mol. Mass.:
35797.87
Organism:
Rattus norvegicus
Description:
ChEMBL_1512484
Residue:
316
  
Inhibitor
Name:
BDBM50016549
Synonyms:
CHEMBL37072 | [(4-Methoxy-benzenesulfonyl)-phenyl-amino]-acetic acid
Type:
Small organic molecule
Emp. Form.:
C15H15NO5S
Mol. Mass.:
321.348
SMILES:
COc1ccc(cc1)S(=O)(=O)N(CC(O)=O)c1ccccc1
: