Target
Aldo-keto reductase family 1 member B1
Ligand
BDBM50016553
Substrate
Meas. Tech.
ChEBML_32099
IC50
380±n/a nM
Citation
 DeRuiter, JBorne, RFMayfield, CA N- and 2-substituted N-(phenylsulfonyl)glycines as inhibitors of rat lens aldose reductase. J Med Chem 32:145-51 (1989)  
Target
Name:
Aldo-keto reductase family 1 member B1
Synonyms:
ALDR_RAT Akr1b4 Aldr1
Type:
PROTEIN
Mol. Mass.:
35797.87
Organism:
Rattus norvegicus
Description:
ChEMBL_1512484
Residue:
316
  
Inhibitor
Name:
BDBM50016553
Synonyms:
CHEMBL36108 | [(4-Benzoylamino-benzenesulfonyl)-phenyl-amino]-acetic acid
Type:
Small organic molecule
Emp. Form.:
C21H18N2O5S
Mol. Mass.:
410.443
SMILES:
OC(=O)CN(c1ccccc1)S(=O)(=O)c1ccc(NC(=O)c2ccccc2)cc1
: