Target
Prostaglandin F2-alpha receptor
Ligand
BDBM50405736
Substrate
Meas. Tech.
ChEBML_152620
IC50
68000±n/a nM
Citation
 Kawada, KDolence, EKMorita, HKometani, TWatt, DSBalapure, AFitz, TAOrlicky, DJGerschenson, LE Prostaglandin photoaffinity probes: synthesis and biological activity of azide-substituted 16-phenoxy- and 17-phenyl-PGF2 alpha prostaglandins. J Med Chem 32:256-64 (1989)  
Target
Name:
Prostaglandin F2-alpha receptor
Synonyms:
PF2R_BOVIN PGF2 alpha receptor ProstaglandinF2Alpha | Prostanoid FP receptor
Type:
Enzyme Catalytic Domain
Mol. Mass.:
41044.75
Organism:
BOVINE
Description:
ProstaglandinF2Alpha PTGFR BOVINE::P37289
Residue:
362
  
Inhibitor
Name:
BDBM50405736
Synonyms:
CHEMBL2114224
Type:
Small organic molecule
Emp. Form.:
C23H30IN3O5
Mol. Mass.:
555.4059
SMILES:
O[C@H](CCc1ccc(N=[N+]=[N-])c(I)c1)\C=C\[C@H]1[C@H](O)C[C@H](O)[C@@H]1C\C=C/CCCC(O)=O
: