Target
Delta-type opioid receptor
Ligand
BDBM50001465
Substrate
Meas. Tech.
ChEMBL_147195 (CHEMBL756871)
Ki
1.5±n/a nM
Citation
 Bryan, WMCallahan, JFCodd, EELemieux, CMoore, MLSchiller, PWWalker, RFHuffman, WF Cyclic enkephalin analogues containing alpha-amino-beta-mercapto-beta,beta-pentamethylenepropionic acid at positions 2 or 5. J Med Chem 32:302-4 (1989)  
Target
Name:
Delta-type opioid receptor
Synonyms:
Cytochrome P450 3A4 Delta opioid receptor Delta-type opioid receptor (DOR) OPRD_RAT Opioid receptor Opioid receptors; mu & delta Ror-a | Voltage-gated potassium channel
Type:
G Protein-Coupled Receptor (GPCR)
Mol. Mass.:
40465.04
Organism:
Rattus norvegicus (rat)
Description:
Competition binding assays were using CHO-K1 cell membranes expressing the opioid receptor.
Residue:
372
  
Inhibitor
Name:
BDBM50001465
Synonyms:
(S)-2-[(S)-2-(2-{2-[(S)-2-Amino-3-(4-hydroxy-phenyl)-propionylamino]-acetylamino}-acetylamino)-3-phenyl-propionylamino]-4-methyl-pentanoic acid (enkephalin)2-[2-(2-{2-[2-Amino-3-(4-hydroxy-phenyl)-propionylamino]-acetylamino}-acetylamino)-3-phenyl-propionylamino]-4-methyl-pentanoic acid 2-[(S)-2-(2-{2-[(S)-2-Amino-3-(4-hydroxy-phenyl)-propionylamino]-acetylamino}-acetylamino)-3-phenyl-propionylamino]-4-methyl-pentanoic acid 2-[2-(2-{2-[2-Amino-3-(4-hydroxy-phenyl)-propionylamino]-acetylamino}-acetylamino)-3-phenyl-propionylamino]-4-methyl-pentanoic acid 2-{1-[1-amino-2-(4-hydroxyphenyl)ethylcarboxamidomethylcarboxamidomethylcarboxamido]-2-phenylethylcarboxamido}-4-methylpentanoic acid ENKEPHALIN Leu5-Enkephalin | Tyr-Gly-Gly-Phe-Leu-OH
Type:
Small organic molecule
Emp. Form.:
C28H37N5O7
Mol. Mass.:
555.6227
SMILES:
CC(C)C[C@H](NC(=O)[C@H](Cc1ccccc1)NC(=O)CNC(=O)CNC(=O)[C@@H](N)Cc1ccc(O)cc1)C(O)=O
: