Target
Serotonin 2 (5-HT2) receptor
Ligand
BDBM50016966
Substrate
Meas. Tech.
ChEMBL_2157 (CHEMBL617238)
IC50
5.7±n/a nM
Citation
 New, JSChristopher, WLYevich, JPButler, RSchlemmer, RFVanderMaelen, CPCipollina, JA The thieno[3,2-c]pyridine and furo[3,2-c]pyridine rings: new pharmacophores with potential antipsychotic activity. J Med Chem 32:1147-56 (1989)  
Target
Name:
Serotonin 2 (5-HT2) receptor
Synonyms:
5-hydroxytryptamine receptor 2A/2B/2C
Type:
Mol. Mass.:
Description:
ASSAY_ID of ChEMBL is 2197419
Components:
This complex has 3 components.
Component 1
Name:
5-hydroxytryptamine receptor 2B
Synonyms:
5-HT2B 5HT2B_RAT Serotonin 2b (5-HT2b) receptor Srl
Type:
Enzyme Catalytic Domain
Mol. Mass.:
53668.47
Organism:
RAT
Description:
5-HT2B HTR2B RAT::P30994
Residue:
479
  
Component 2
Name:
5-hydroxytryptamine receptor 2C
Synonyms:
5-HT2C 5-hydroxytryptamine receptor 2C (5HT2c) 5ht1c Htr2c Serotonin receptor 2a and 2c (5HT2A and 5HT2C)
Type:
Enzyme
Mol. Mass.:
51935.10
Organism:
Rattus norvegicus (Rat)
Description:
P08909
Residue:
460
  
Component 3
Name:
5-hydroxytryptamine receptor 2A
Synonyms:
5-HT-2A 5-HT2A 5-hydroxytryptamine receptor 2A (5HT2A) Htr2 Serotonin Receptor 2A
Type:
G Protein-Coupled Receptor (GPCR)
Mol. Mass.:
52852.05
Organism:
Rattus norvegicus (rat)
Description:
Rat cortex membranes 5-HT2A receptors.
Residue:
471
  
Inhibitor
Name:
BDBM50016966
Synonyms:
1,1-Dioxo-2-[4-(4-thieno[3,2-c]pyridin-4-yl-piperazin-1-yl)-butyl]-1,2-dihydro-1lambda*6*-benzo[d]isothiazol-3-one; hydrochloride | CHEMBL543967
Type:
Small organic molecule
Emp. Form.:
C22H24N4O3S2
Mol. Mass.:
456.581
SMILES:
O=C1N(CCCCN2CCN(CC2)c2nccc3sccc23)S(=O)(=O)c2ccccc12
: