Target
5-hydroxytryptamine receptor 1A
Ligand
BDBM50016968
Substrate
Meas. Tech.
ChEMBL_819 (CHEMBL615819)
IC50
6.2±n/a nM
Citation
 New, JSChristopher, WLYevich, JPButler, RSchlemmer, RFVanderMaelen, CPCipollina, JA The thieno[3,2-c]pyridine and furo[3,2-c]pyridine rings: new pharmacophores with potential antipsychotic activity. J Med Chem 32:1147-56 (1989)  
Target
Name:
5-hydroxytryptamine receptor 1A
Synonyms:
5-HT-1A 5-HT1A 5-hydroxytryptamine receptor 1A (5HT1A) 5ht1a Htr1a Serotonin 1a (5-HT1a) receptor/Adrenergic receptor alpha-1 | Serotonin receptor 1A
Type:
G Protein-Coupled Receptor (GPCR)
Mol. Mass.:
46445.29
Organism:
Rattus norvegicus (rat)
Description:
Binding assays were performed using rat hippocampal membranes.
Residue:
422
  
Inhibitor
Name:
BDBM50016968
Synonyms:
1-(4-Fluoro-phenyl)-4-[4-(2-methyl-furo[3,2-c]pyridin-4-yl)-piperazin-1-yl]-butan-1-ol; hydrochloride | CHEMBL557995
Type:
Small organic molecule
Emp. Form.:
C22H26FN3O2
Mol. Mass.:
383.4591
SMILES:
Cc1cc2c(nccc2o1)N1CCN(CCCC(O)c2ccc(F)cc2)CC1
: