Target
Aminopeptidase B
Ligand
BDBM23971
Substrate
Meas. Tech.
ChEMBL_35351 (CHEMBL647933)
Ki
14±n/a nM
Citation
 Harbeson, SLRich, DH Inhibition of aminopeptidases by peptides containing ketomethylene and hydroxyethylene amide bond replacements. J Med Chem 32:1378-92 (1989)  
Target
Name:
Aminopeptidase B
Synonyms:
AMPB_RAT Arginine aminopeptidase Cytosol aminopeptidase IV | Rnpep
Type:
PROTEIN
Mol. Mass.:
72609.93
Organism:
Rattus norvegicus
Description:
ChEMBL_1344423
Residue:
650
  
Inhibitor
Name:
BDBM23971
Synonyms:
(2S)-2-[(2S,3R)-3-amino-2-hydroxy-4-phenylbutanamido]-4-methylpentanoic acid CHEMBL29292 | Ubenimex
Type:
Small organic molecule
Emp. Form.:
C16H24N2O4
Mol. Mass.:
308.3728
SMILES:
CC(C)C[C@H](NC(=O)[C@@H](O)[C@H](N)Cc1ccccc1)C(O)=O
: