Target
Adenosine receptor A1
Ligand
BDBM50009506
Substrate
Meas. Tech.
ChEMBL_29632 (CHEMBL639739)
Ki
1.2±n/a nM
Citation
 Trivedi, BKBruns, RF C2,N6-disubstituted adenosines: synthesis and structure-activity relationships. J Med Chem 32:1667-73 (1989)  
Target
Name:
Adenosine receptor A1
Synonyms:
AA1R_RAT ADENOSINE A1 high Adenosine A1 receptor (A1) Adenosine receptors A1 | Adora1
Type:
Protein
Mol. Mass.:
36704.13
Organism:
Rattus norvegicus (rat)
Description:
Residue:
326
  
Inhibitor
Name:
BDBM50009506
Synonyms:
(R)-2-Hydroxymethyl-5-[6-(1-methyl-2-phenyl-ethylamino)-purin-9-yl]-tetrahydro-furan-3,4-diol (S)-2-Hydroxymethyl-5-[6-(1-methyl-2-phenyl-ethylamino)-purin-9-yl]-tetrahydro-furan-3,4-diol CHEMBL86605 L-2-Hydroxymethyl-5-[6-(1-methyl-2-phenyl-ethylamino)-purin-9-yl]-tetrahydro-furan-3,4-diol
Type:
Small organic molecule
Emp. Form.:
C19H23N5O4
Mol. Mass.:
385.417
SMILES:
CC(Cc1ccccc1)Nc1ncnc2n(cnc12)C1O[C@H](CO)[C@@H](O)[C@H]1O
: