Target
Chymotrypsinogen A
Ligand
BDBM50014571
Substrate
Meas. Tech.
ChEBML_216617
Ki
200±n/a nM
Citation
 Angelastro, MRMehdi, SBurkhart, JPPeet, NPBey, P Alpha-diketone and alpha-keto ester derivatives of N-protected amino acids and peptides as novel inhibitors of cysteine and serine proteinases. J Med Chem 33:11-3 (1990)  
Target
Name:
Chymotrypsinogen A
Synonyms:
Alpha-chymotrypsin Chymotrypsin A Chymotrypsin A chain B Chymotrypsinogen A | alpha-Chymotrypsin (α-Chymotrypsin)
Type:
Serine protease
Mol. Mass.:
25670.88
Organism:
Bos taurus (bovine)
Description:
Residue:
245
  
Inhibitor
Name:
BDBM50014571
Synonyms:
CHEMBL24283 | [1-(1-Benzyl-2,3-dioxo-butylcarbamoyl)-2-methyl-propyl]-carbamic acid benzyl ester
Type:
Small organic molecule
Emp. Form.:
C24H28N2O5
Mol. Mass.:
424.4895
SMILES:
CC(C)[C@H](NC(=O)OCc1ccccc1)C(=O)N[C@@H](Cc1ccccc1)C(=O)C(C)=O
: