Target
Amine oxidase [flavin-containing] A
Ligand
BDBM50014636
Substrate
Meas. Tech.
ChEBML_122785
Ki
6000±n/a nM
Citation
 Bembenek, MEAbell, CWChrisey, LARozwadowska, MDGessner, WBrossi, A Inhibition of monoamine oxidases A and B by simple isoquinoline alkaloids: racemic and optically active 1,2,3,4-tetrahydro-, 3,4-dihydro-, and fully aromatic isoquinolines. J Med Chem 33:147-52 (1990)  
Target
Name:
Amine oxidase [flavin-containing] A
Synonyms:
AOFA_HUMAN MAO-A Monoamine oxidase Monoamine oxidase type A (MAO A) Monoamine oxidase type A (MAOA)
Type:
Protein
Mol. Mass.:
59689.53
Organism:
Homo sapiens (Human)
Description:
P21397
Residue:
527
  
Inhibitor
Name:
BDBM50014636
Synonyms:
6,7-Dimethoxy-1-methyl-1,2,3,4-tetrahydro-isoquinoline; hydrochloride ((+)-(R)-salsolidine) | CHEMBL540259
Type:
Small organic molecule
Emp. Form.:
C12H17NO2
Mol. Mass.:
207.2689
SMILES:
COc1cc2CCN[C@H](C)c2cc1OC
: