Target
5-hydroxytryptamine receptor 3B
Ligand
BDBM50013042
Substrate
Meas. Tech.
ChEBML_3121
Ki
116±n/a nM
Citation
 Rizzi, JPNagel, AARosen, TMcLean, SSeeger, T An initial three-component pharmacophore for specific serotonin-3 receptor ligands. J Med Chem 33:2721-5 (1990)  
Target
Name:
5-hydroxytryptamine receptor 3B
Synonyms:
5HT3B_MOUSE Serotonin 3 receptor (5HT3) | Serotonin 3b (5-HT3b) receptor
Type:
PROTEIN
Mol. Mass.:
50317.35
Organism:
Mus musculus
Description:
ChEMBL_3121
Residue:
437
  
Inhibitor
Name:
BDBM50013042
Synonyms:
CHEMBL92180 | N-(4-Methyl-thiazol-2-ylmethyl)-guanidine
Type:
Small organic molecule
Emp. Form.:
C6H10N4S
Mol. Mass.:
170.235
SMILES:
Cc1csc(CNC(N)=N)n1
: